BDBM242506 US9422235, 89
SMILES CC(C)(C)C1CCC(CC1)Nc1ccc(c(c1)C(F)(F)F)S(=O)(=O)NCC1CC1
InChI Key InChIKey=LCXRSRUMUPQQQR-UHFFFAOYSA-N
Data  1 KI  1 IC50
  Tab Delimited (TSV)   2D SDfile   Computed 3D by Vconf -m prep SDfile
Find this compound or compounds like it in BindingDB:
Activity Spreadsheet -- Enzyme Inhibition Constant Data from BindingDB
Found 1 hit for monomerid = 242506
TargetCannabinoid receptor 2(Homo sapiens (Human))
Pharmos
US Patent
LigandPNGBDBM242506(US9422235, 89)
Affinity DataKi:  1.07E+3nM ΔG°:  -8.28kcal/mole IC50:  1.89E+3nMT: 2°C. Assay description: The binding assays were performed by testing the ability of the new compounds to displace the radiolabeled synthetic non-selective cannabinoid agonis...
Ligand InfoPC cidPC sid
In DepthDetails US Patent