BDBM24253 (4R)-4-amino-4-{[4-(benzyloxy)phenyl]carbamoyl}butanoic acid::Amino acid analog, 4c
SMILES N[C@H](CCC(O)=O)C(=O)Nc1ccc(OCc2ccccc2)cc1
InChI Key InChIKey=IYYBWKOXCQKLHX-MRXNPFEDSA-N
Data  1 IC50
  Tab Delimited (TSV)   2D SDfile   Computed 3D by Vconf -m prep SDfile
Find this compound or compounds like it in BindingDB:
Activity Spreadsheet -- Enzyme Inhibition Constant Data from BindingDB
Found 1 hit for monomerid = 24253
TargetLeukotriene A-4 hydrolase(Homo sapiens (Human))
Berlex Biosciences
LigandPNGBDBM24253((4R)-4-amino-4-{[4-(benzyloxy)phenyl]carbamoyl}but...)
Affinity DataIC50:  7.20E+3nMpH: 7.5 T: 2°C. Assay description: Compound potency against the peptidase activity of LTA4 hydrolase was measured by inhibition of the hydrolysis of L-alanine-p-nitroanilide to L-alani...
In DepthDetails ArticlePubMed