BDBM24254 (3R)-3-amino-3-{[4-(benzyloxy)phenyl]carbamoyl}propanoic acid::Amino acid analog, 4d
SMILES N[C@H](CC(O)=O)C(=O)Nc1ccc(OCc2ccccc2)cc1
InChI Key InChIKey=VTMSXGVEMJOFRJ-OAHLLOKOSA-N
Data  1 IC50
  Tab Delimited (TSV)   2D SDfile   Computed 3D by Vconf -m prep SDfile
Find this compound or compounds like it in BindingDB:
Activity Spreadsheet -- Enzyme Inhibition Constant Data from BindingDB
Found 1 hit for monomerid = 24254
TargetLeukotriene A-4 hydrolase(Homo sapiens (Human))
Berlex Biosciences
LigandPNGBDBM24254((3R)-3-amino-3-{[4-(benzyloxy)phenyl]carbamoyl}pro...)
Affinity DataIC50:  9.30E+3nMpH: 7.5 T: 2°C. Assay description: Compound potency against the peptidase activity of LTA4 hydrolase was measured by inhibition of the hydrolysis of L-alanine-p-nitroanilide to L-alani...
In DepthDetails ArticlePubMed