BDBM242601 (S)-N-((S)-5-(4-aminobenzoyl)-1-((5- bromo-2-methoxynaphthalen-1- yl)methyl)-7-chloro-2-oxo-2,3,4,5- tetrahydro-1H-benzo[b][1,4]diazepin-3- yl)-2-(methylamino)propanamide hydrochloride::US10053431, 123
SMILES CN[C@@H](C)C(=O)N[C@H]1CN(C(=O)c2ccc(N)cc2)c2cc(Cl)ccc2N(Cc2c(OC)ccc3c(Br)cccc23)C1=O
InChI Key InChIKey=ZPWXNJPAHZEINN-QYBDOPJKSA-N
Data  2 IC50
  Tab Delimited (TSV)   2D SDfile   Computed 3D by Vconf -m prep SDfile
Find this compound or compounds like it in BindingDB:
Activity Spreadsheet -- Enzyme Inhibition Constant Data from BindingDB
Found 2 hits for monomerid = 242601
TargetE3 ubiquitin-protein ligase XIAP [241-356](Homo sapiens (Human))
Hoffmann-La Roche
US Patent
LigandPNGBDBM242601((S)-N-((S)-5-(4-aminobenzoyl)-1-((5- bromo-2-metho...)
Affinity DataIC50:  1.87E+4nMpH: 7.5 T: 2°C. Assay description: Ten nanomolar of 6× Histidine-tagged BIR2 domain, corresponding to amino acids 124-240 of XIAP, or BIR3 domain, corresponding to amino acids 241-356 ...
Ligand InfoPC cidPC sid
In DepthDetails US Patent
TargetE3 ubiquitin-protein ligase XIAP [124-240](Homo sapiens (Human))
Hoffmann-La Roche
US Patent
LigandPNGBDBM242601((S)-N-((S)-5-(4-aminobenzoyl)-1-((5- bromo-2-metho...)
Affinity DataIC50:  6.71nMpH: 7.5 T: 2°C. Assay description: Ten nanomolar of 6× Histidine-tagged BIR2 domain, corresponding to amino acids 124-240 of XIAP, or BIR3 domain, corresponding to amino acids 241-356 ...
Ligand InfoPC cidPC sid
In DepthDetails US Patent