BDBM242636 5-(((S)-5-(4-aminobutanoyl)-3-((S)-2-(methylamino)propanamido)-2-oxo-2,3,4,5-tetrahydro-1H-benzo[b][1,4]diazepin-1-yl)methyl)-6-methoxy-2-naphthoic acid hydrochloride::US10053431, 50
SMILES CN[C@@H](C)C(=O)N[C@H]1CN(C(=O)CCCN)c2ccccc2N(Cc2c(OC)ccc3cc(ccc23)C(O)=O)C1=O
InChI Key InChIKey=CDLJEUGALIIVIE-MBSDFSHPSA-N
Data  2 IC50
  Tab Delimited (TSV)   2D SDfile   Computed 3D by Vconf -m prep SDfile
Find this compound or compounds like it in BindingDB:
Activity Spreadsheet -- Enzyme Inhibition Constant Data from BindingDB
Found 2 hits for monomerid = 242636
TargetE3 ubiquitin-protein ligase XIAP [241-356](Homo sapiens (Human))
Hoffmann-La Roche
US Patent
LigandPNGBDBM242636(5-(((S)-5-(4-aminobutanoyl)-3-((S)-2-(methylamino)...)
Affinity DataIC50:  1.85E+4nMpH: 7.5 T: 2°C. Assay description: Ten nanomolar of 6× Histidine-tagged BIR2 domain, corresponding to amino acids 124-240 of XIAP, or BIR3 domain, corresponding to amino acids 241-356 ...
Ligand InfoPC cidPC sid
In DepthDetails US Patent
TargetE3 ubiquitin-protein ligase XIAP [124-240](Homo sapiens (Human))
Hoffmann-La Roche
US Patent
LigandPNGBDBM242636(5-(((S)-5-(4-aminobutanoyl)-3-((S)-2-(methylamino)...)
Affinity DataIC50:  13nMpH: 7.5 T: 2°C. Assay description: Ten nanomolar of 6× Histidine-tagged BIR2 domain, corresponding to amino acids 124-240 of XIAP, or BIR3 domain, corresponding to amino acids 241-356 ...
Ligand InfoPC cidPC sid
In DepthDetails US Patent