BDBM242693 US9422290, I-6
SMILES CNc1cc(nn2c(C)nnc12)N(C)Cc1ccc(F)cc1
InChI Key InChIKey=FEDNFGKDPCVEHU-UHFFFAOYSA-N
Data  1 IC50
  Tab Delimited (TSV)   2D SDfile   Computed 3D by Vconf -m prep SDfile
Find this compound or compounds like it in BindingDB:
Activity Spreadsheet -- Enzyme Inhibition Constant Data from BindingDB
Found 1 hit for monomerid = 242693
TargetBromodomain-containing protein 4 [44-168](Homo sapiens (Human))
Boehringer Ingelheim International
US Patent
LigandPNGBDBM242693(US9422290, I-6)
Affinity DataIC50:  74nM. Assay description: Compounds are diluted in serial dilution 1:5 in assay buffer from 10 mM stock in DMSO (100 μM start concentration) in white OptiPlate-384 (Perki...
Ligand InfoPC cidPC sid
In DepthDetails US Patent