BDBM242724 US9422297, AAG145-131
SMILES Nc1nc2Cc3ccccc3-c2c(Nc2cccc(Br)c2)n1
InChI Key InChIKey=QVKUVEHRSYCMGZ-UHFFFAOYSA-N
Data  3 IC50
  Tab Delimited (TSV)   2D SDfile   Computed 3D by Vconf -m prep SDfile
Find this compound or compounds like it in BindingDB:
Activity Spreadsheet -- Enzyme Inhibition Constant Data from BindingDB
Found 3 hits for monomerid = 242724
TargetEpidermal growth factor receptor(Homo sapiens (Human))
Duquesne University Of The Holy Ghost
US Patent
LigandPNGBDBM242724(US9422297, AAG145-131 )
Affinity DataIC50:  2.41E+4nM. Assay description: Inhibition of various kinase enzyme.
Ligand InfoPC cidPC sid
In DepthDetails US Patent
TargetPlatelet-derived growth factor receptor beta(Homo sapiens (Human))
Duquesne University Of The Holy Ghost
US Patent
LigandPNGBDBM242724(US9422297, AAG145-131 )
Affinity DataIC50:  1.26E+5nM. Assay description: Inhibition of various kinase enzyme.
Ligand InfoPC cidPC sid
In DepthDetails US Patent
TargetVascular endothelial growth factor receptor 2(Homo sapiens (Human))
Duquesne University Of The Holy Ghost
US Patent
LigandPNGBDBM242724(US9422297, AAG145-131 )
Affinity DataIC50: >2.00E+5nM. Assay description: Inhibition of various kinase enzyme.
Ligand InfoPC cidPC sid
In DepthDetails US Patent