BDBM242738 US9422297, AAG145-347
SMILES Nc1nc-2c(Cc3ccccc-23)c(Nc2ccc(F)cc2)n1
InChI Key InChIKey=INMJXDOKKQDBSI-UHFFFAOYSA-N
Data  2 IC50
  Tab Delimited (TSV)   2D SDfile   Computed 3D by Vconf -m prep SDfile
Find this compound or compounds like it in BindingDB:
Activity Spreadsheet -- Enzyme Inhibition Constant Data from BindingDB
Found 2 hits for monomerid = 242738
TargetVascular endothelial growth factor receptor 2(Homo sapiens (Human))
Duquesne University Of The Holy Ghost
US Patent
LigandPNGBDBM242738(US9422297, AAG145-347)
Affinity DataIC50:  2.19E+4nM. Assay description: Inhibition of various kinase enzyme.
Ligand InfoPC cidPC sid
In DepthDetails US Patent
TargetEpidermal growth factor receptor(Homo sapiens (Human))
Duquesne University Of The Holy Ghost
US Patent
LigandPNGBDBM242738(US9422297, AAG145-347)
Affinity DataIC50: >3.00E+5nM. Assay description: Inhibition of various kinase enzyme.
Ligand InfoPC cidPC sid
In DepthDetails US Patent