BDBM24274 (2S)-2-amino-4-{[4-(2-phenylethoxy)phenyl]carbamoyl}butanoic acid::Modified amino acid analog, 8i
SMILES N[C@@H](CCC(=O)Nc1ccc(OCCc2ccccc2)cc1)C(O)=O
InChI Key InChIKey=LXNLZSBSUTWVJA-KRWDZBQOSA-N
Data  1 IC50
  Tab Delimited (TSV)   2D SDfile   Computed 3D by Vconf -m prep SDfile
Find this compound or compounds like it in BindingDB:
Activity Spreadsheet -- Enzyme Inhibition Constant Data from BindingDB
Found 1 hit for monomerid = 24274
TargetLeukotriene A-4 hydrolase(Homo sapiens (Human))
Berlex Biosciences
LigandPNGBDBM24274((2S)-2-amino-4-{[4-(2-phenylethoxy)phenyl]carbamoy...)
Affinity DataIC50:  46nM. Assay description: Compound potency against the peptidase activity of LTA4 hydrolase was measured by inhibition of the hydrolysis of L-alanine-p-nitroanilide to L-alani...
In DepthDetails ArticlePubMed