BDBM242771 US10030025, Compound 37::US10836768, Cpd no 37::US11731974, Compound 37::US9422299, 37::US9987274, Compound 37
SMILES CC1N(CCn2c1nnc2-c1nc(C)ns1)C(=O)c1ccc(Cl)cc1
InChI Key InChIKey=ZMIOQWILBZBCHW-UHFFFAOYSA-N
Data  16 KI  3 IC50
  Tab Delimited (TSV)   2D SDfile   Computed 3D by Vconf -m prep SDfile
Find this compound or compounds like it in BindingDB:
Activity Spreadsheet -- Enzyme Inhibition Constant Data from BindingDB
Found 19 hits for monomerid = 242771
TargetNeuromedin-K receptor(Homo sapiens (Human))
Ogeda
US Patent
LigandPNGBDBM242771(US10030025, Compound 37 | US10836768, Cpd no 37 | ...)
Affinity DataKi:  41nM. Assay description: The ability of compounds of the invention to inhibit the binding of the NK-3 receptor selective antagonist3 H-SB222200 was assessed by an in vitro ra...
Ligand InfoPC cidPC sid
In DepthDetails US Patent
TargetNeuromedin-K receptor(Homo sapiens (Human))
Ogeda
US Patent
LigandPNGBDBM242771(US10030025, Compound 37 | US10836768, Cpd no 37 | ...)
Affinity DataKi:  41nM. Assay description: The affinity of compounds of the invention for the human NK-3 receptor was determined by measuring the ability of compounds of the invention to compe...
Ligand InfoPC cidPC sid
In DepthDetails US Patent
TargetNeuromedin-K receptor(Homo sapiens (Human))
Ogeda
US Patent
LigandPNGBDBM242771(US10030025, Compound 37 | US10836768, Cpd no 37 | ...)
Affinity DataKi:  41nMpH: 7.4Assay Description:The affinity of compounds of the invention for the human NK-3 receptor was determined by measuring the ability of compounds of the invention to compe...
Ligand InfoPC cidPC sid
In DepthDetails US Patent
TargetNeuromedin-K receptor(Homo sapiens (Human))
Ogeda
US Patent
LigandPNGBDBM242771(US10030025, Compound 37 | US10836768, Cpd no 37 | ...)
Affinity DataKi:  41nM. Assay description: Human NK-3: The ability of compounds of the invention to inhibit the binding of the NK-3 receptor selective antagonist 3H-SB222200 was assessed by an...
Ligand InfoPC cidPC sid
In DepthDetails US Patent
TargetNeuromedin-K receptor(Homo sapiens (Human))
Ogeda
US Patent
LigandPNGBDBM242771(US10030025, Compound 37 | US10836768, Cpd no 37 | ...)
Affinity DataKi:  41nMpH: 7.4Assay Description:The affinity of compounds of the invention for the human NK-3 receptor was determined by measuring the ability of compounds of the invention to compe...
Ligand InfoPC cidPC sid
In DepthDetails US Patent
TargetNeuromedin-K receptor(Homo sapiens (Human))
Ogeda
US Patent
LigandPNGBDBM242771(US10030025, Compound 37 | US10836768, Cpd no 37 | ...)
Affinity DataKi:  41nM. Assay description: The ability of compounds of the invention to inhibit the binding of the NK-3 receptor selective antagonist3 H-SB222200 was assessed by an in vitro ra...
Ligand InfoPC cidPC sid
In DepthDetails US Patent
TargetSubstance-K receptor(Homo sapiens (Human))
Ogeda
US Patent
LigandPNGBDBM242771(US10030025, Compound 37 | US10836768, Cpd no 37 | ...)
Affinity DataKi: >3.00E+4nM. Assay description: The affinity of compounds of the invention for the NK-2 receptor was evaluated in CHO recombinant cells which express the human NK-2 receptor. Membra...
Ligand InfoPC cidPC sid
In DepthDetails US Patent
TargetSubstance-K receptor(Homo sapiens (Human))
Ogeda
US Patent
LigandPNGBDBM242771(US10030025, Compound 37 | US10836768, Cpd no 37 | ...)
Affinity DataKi: >3.00E+4nM. Assay description: Human NK-2 The affinity of compounds of the invention for the NK-2 receptor was evaluated in CHO recombinant cells which express the human NK-2 recep...
Ligand InfoPC cidPC sid
In DepthDetails US Patent
TargetSubstance-K receptor(Homo sapiens (Human))
Ogeda
US Patent
LigandPNGBDBM242771(US10030025, Compound 37 | US10836768, Cpd no 37 | ...)
Affinity DataKi: >3.00E+4nM ΔG°: >-6.17kcal/molepH: 7.4 T: 2°C. Assay description: The affinity of compounds of the invention for the NK-2 receptor was evaluated in CHO recombinant cells which express the human NK-2 receptor. Membra...
Ligand InfoPC cidPC sid
In DepthDetails US Patent
TargetSubstance-K receptor(Homo sapiens (Human))
Ogeda
US Patent
LigandPNGBDBM242771(US10030025, Compound 37 | US10836768, Cpd no 37 | ...)
Affinity DataKi: >3.00E+4nM ΔG°: >-6.17kcal/molepH: 7.4 T: 2°C. Assay description: The affinity of compounds of the invention for the NK-2 receptor was evaluated in CHO recombinant cells which express the human NK-2 receptor. Membra...
Ligand InfoPC cidPC sid
In DepthDetails US Patent
TargetSubstance-K receptor(Homo sapiens (Human))
Ogeda
US Patent
LigandPNGBDBM242771(US10030025, Compound 37 | US10836768, Cpd no 37 | ...)
Affinity DataKi: >3.00E+4nM. Assay description: The affinity of compounds of the invention for the NK-2 receptor was evaluated in CHO recombinant cells which express the human NK-2 receptor. Membra...
Ligand InfoPC cidPC sid
In DepthDetails US Patent
TargetSubstance-P receptor(Homo sapiens (Human))
Ogeda
US Patent
LigandPNGBDBM242771(US10030025, Compound 37 | US10836768, Cpd no 37 | ...)
Affinity DataKi:  3.20E+4nM. Assay description: The affinity of compounds of the invention for the NK-1 receptor was evaluated in CHO recombinant cells which express the human NK-1 receptor. Membra...
Ligand InfoPC cidPC sid
In DepthDetails US Patent
TargetSubstance-P receptor(Homo sapiens (Human))
Ogeda
US Patent
LigandPNGBDBM242771(US10030025, Compound 37 | US10836768, Cpd no 37 | ...)
Affinity DataKi:  3.20E+4nM ΔG°:  -6.13kcal/molepH: 7.4 T: 2°C. Assay description: The affinity of compounds of the invention for the NK-1 receptor was evaluated in CHO recombinant cells which express the human NK-1 receptor. Membra...
Ligand InfoPC cidPC sid
In DepthDetails US Patent
TargetSubstance-P receptor(Homo sapiens (Human))
Ogeda
US Patent
LigandPNGBDBM242771(US10030025, Compound 37 | US10836768, Cpd no 37 | ...)
Affinity DataKi:  3.20E+4nM ΔG°:  -6.13kcal/molepH: 7.4 T: 2°C. Assay description: The affinity of compounds of the invention for the NK-1 receptor was evaluated in CHO recombinant cells which express the human NK-1 receptor. Membra...
Ligand InfoPC cidPC sid
In DepthDetails US Patent
TargetSubstance-P receptor(Homo sapiens (Human))
Ogeda
US Patent
LigandPNGBDBM242771(US10030025, Compound 37 | US10836768, Cpd no 37 | ...)
Affinity DataKi:  3.20E+4nM. Assay description: Human NK-1: The affinity of compounds of the invention for the NK-1 receptor was evaluated in CHO recombinant cells which express the human NK-1 rece...
Ligand InfoPC cidPC sid
In DepthDetails US Patent
TargetSubstance-P receptor(Homo sapiens (Human))
Ogeda
US Patent
LigandPNGBDBM242771(US10030025, Compound 37 | US10836768, Cpd no 37 | ...)
Affinity DataKi:  3.20E+4nM. Assay description: The affinity of compounds of the invention for the NK-1 receptor was evaluated in CHO recombinant cells which express the human NK-1 receptor. Membra...
Ligand InfoPC cidPC sid
In DepthDetails US Patent
TargetNeuromedin-K receptor(Homo sapiens (Human))
Ogeda
US Patent
LigandPNGBDBM242771(US10030025, Compound 37 | US10836768, Cpd no 37 | ...)
Affinity DataIC50:  52nM. Assay description: Chinese Hamster Ovary recombinant cells expressing the human NK-3 receptor and a construct that encodes the photoprotein apoaequorin were used for th...
Ligand InfoPC cidPC sid
In DepthDetails US Patent
TargetNeuromedin-K receptor(Homo sapiens (Human))
Ogeda
US Patent
LigandPNGBDBM242771(US10030025, Compound 37 | US10836768, Cpd no 37 | ...)
Affinity DataIC50:  52nM. Assay description: Changes in intracellular calcium levels are a recognized indicator of G protein-coupled receptor activity. The efficacy of compounds of the invention...
Ligand InfoPC cidPC sid
In DepthDetails US Patent
TargetNeuromedin-K receptor(Homo sapiens (Human))
Ogeda
US Patent
LigandPNGBDBM242771(US10030025, Compound 37 | US10836768, Cpd no 37 | ...)
Affinity DataIC50:  52nM. Assay description: Changes in intracellular calcium levels are a recognized indicator of G protein-coupled receptor activity. The efficacy of compounds of the invention...
Ligand InfoPC cidPC sid
In DepthDetails US Patent