BDBM242840 US9422332, 26
SMILES CN[C@@H](C)C(=O)N[C@@H](C(C)C)C(=O)N1Cc2ccccc2[C@H]1C(=O)Nc1ccccc1Cl
InChI Key InChIKey=GRROBYAGJCKXGO-JHVJFLLYSA-N
Data  2 IC50
  Tab Delimited (TSV)   2D SDfile   Computed 3D by Vconf -m prep SDfile
Find this compound or compounds like it in BindingDB:
Activity Spreadsheet -- Enzyme Inhibition Constant Data from BindingDB
Found 2 hits for monomerid = 242840
TargetE3 ubiquitin-protein ligase XIAP [241-356](Homo sapiens (Human))
Hoffmann-La Roche
US Patent
LigandPNGBDBM242840(US9422332, 26)
Affinity DataIC50:  6.08E+3nMpH: 7.5 T: 2°C. Assay description: The peptide AVPIAQKSEK-(ε-biotin)-OH 1:2 TFA ("Peptide A") was identified as a substrate for the TR-FRET assay by screening the 6× Hist...
Ligand InfoPC cidPC sid
In DepthDetails US Patent
TargetE3 ubiquitin-protein ligase XIAP [124-240](Artificial Sequence)
Hoffmann-La Roche
US Patent
LigandPNGBDBM242840(US9422332, 26)
Affinity DataIC50:  21nMpH: 7.5 T: 2°C. Assay description: The peptide AVPIAQKSEK-(ε-biotin)-OH 1:2 TFA ("Peptide A") was identified as a substrate for the TR-FRET assay by screening the 6× Hist...
Ligand InfoPC cidPC sid
In DepthDetails US Patent