BDBM24285 (3S)-3-amino-5-[(4-phenoxyphenyl)carbamoyl]pentanoic acid::Modified amino acid analog, 10
SMILES N[C@@H](CCC(=O)Nc1ccc(Oc2ccccc2)cc1)CC(O)=O
InChI Key InChIKey=YAELJSOADOXCDL-ZDUSSCGKSA-N
Data  1 IC50
  Tab Delimited (TSV)   2D SDfile   Computed 3D by Vconf -m prep SDfile
Find this compound or compounds like it in BindingDB:
Activity Spreadsheet -- Enzyme Inhibition Constant Data from BindingDB
Found 1 hit for monomerid = 24285
TargetLeukotriene A-4 hydrolase(Homo sapiens (Human))
Berlex Biosciences
LigandPNGBDBM24285((3S)-3-amino-5-[(4-phenoxyphenyl)carbamoyl]pentano...)
Affinity DataIC50:  6nM. Assay description: Compound potency against the peptidase activity of LTA4 hydrolase was measured by inhibition of the hydrolysis of L-alanine-p-nitroanilide to L-alani...
In DepthDetails ArticlePubMed