BDBM242860 US9422332, 15
SMILES CC[C@H](C)[C@H](NC(=O)[C@H](C)NC)C(=O)N1CCc2ccccc2[C@H]1C(=O)Nc1c(F)cccc1F
InChI Key InChIKey=KSBNQYOCBLBSQW-BAHGIXHPSA-N
Data  2 IC50
  Tab Delimited (TSV)   2D SDfile   Computed 3D by Vconf -m prep SDfile
Find this compound or compounds like it in BindingDB:
Activity Spreadsheet -- Enzyme Inhibition Constant Data from BindingDB
Found 2 hits for monomerid = 242860
TargetE3 ubiquitin-protein ligase XIAP [241-356](Homo sapiens (Human))
Hoffmann-La Roche
US Patent
LigandPNGBDBM242860(US9422332, 15)
Affinity DataIC50: >5.48E+4nMpH: 7.5 T: 2°C. Assay description: The peptide AVPIAQKSEK-(ε-biotin)-OH 1:2 TFA ("Peptide A") was identified as a substrate for the TR-FRET assay by screening the 6× Hist...
Ligand InfoPC cidPC sid
In DepthDetails US Patent
TargetE3 ubiquitin-protein ligase XIAP [124-240](Artificial Sequence)
Hoffmann-La Roche
US Patent
LigandPNGBDBM242860(US9422332, 15)
Affinity DataIC50:  13nMpH: 7.5 T: 2°C. Assay description: The peptide AVPIAQKSEK-(ε-biotin)-OH 1:2 TFA ("Peptide A") was identified as a substrate for the TR-FRET assay by screening the 6× Hist...
Ligand InfoPC cidPC sid
In DepthDetails US Patent