BDBM24298 (4S)-4-amino-5-(1,3-dioxo-2,3-dihydro-1H-isoindol-2-yl)-N-(4-phenoxyphenyl)pentanamide::Modified amino acid analog, 12h
SMILES N[C@@H](CCC(=O)Nc1ccc(Oc2ccccc2)cc1)CN1C(=O)c2ccccc2C1=O
InChI Key InChIKey=OYEMYFCDXYVMEY-KRWDZBQOSA-N
Data  1 IC50
  Tab Delimited (TSV)   2D SDfile   Computed 3D by Vconf -m prep SDfile
Find this compound or compounds like it in BindingDB:
Activity Spreadsheet -- Enzyme Inhibition Constant Data from BindingDB
Found 1 hit for monomerid = 24298
TargetLeukotriene A-4 hydrolase(Homo sapiens (Human))
Berlex Biosciences
LigandPNGBDBM24298((4S)-4-amino-5-(1,3-dioxo-2,3-dihydro-1H-isoindol-...)
Affinity DataIC50:  85nM. Assay description: Compound potency against the peptidase activity of LTA4 hydrolase was measured by inhibition of the hydrolysis of L-alanine-p-nitroanilide to L-alani...
Ligand InfoPC cidPC sid
In DepthDetails ArticlePubMed