BDBM242980 US9422277, 43
SMILES CN1C(=N)N[C@@](C)(CS1(=O)=O)c1sc(cc1Cl)-c1nnc(o1)-c1ccncn1
InChI Key InChIKey=NLONBIWGSJHHDO-HNNXBMFYSA-N
Data  2 KI
  Tab Delimited (TSV)   2D SDfile   Computed 3D by Vconf -m prep SDfile
Find this compound or compounds like it in BindingDB:
Activity Spreadsheet -- Enzyme Inhibition Constant Data from BindingDB
Found 2 hits for monomerid = 242980
TargetBeta-secretase 2(Homo sapiens (Human))
Merck Sharp & Dohme
US Patent
LigandPNGBDBM242980(US9422277, 43)
Affinity DataKi:  305nM ΔG°:  -9.03kcal/molepH: 5.0 T: 2°C. Assay description: Inhibitor compounds, prepared at 3× the desired final concentration in 1×BACE assay buffer (20 mM sodium acetate pH 5.0, 10% glycerol, 0....
Ligand InfoPC cidPC sid
In DepthDetails US Patent
TargetBeta-secretase 1(Homo sapiens (Human))
Merck Sharp & Dohme
US Patent
LigandPNGBDBM242980(US9422277, 43)
Affinity DataKi:  823nM ΔG°:  -8.43kcal/molepH: 5.0 T: 2°C. Assay description: Varying concentrations of inhibitors at 3× the final desired concentration in a volume of 10 ul are preincubated with purified human BACE1 cata...
Ligand InfoPC cidPC sid
In DepthDetails US Patent