BDBM243001 US9422277, 64
SMILES CCCCCOc1ccc(cc1)-c1nnc(o1)-c1cc(Cl)c(s1)[C@]1(C)CS(=O)(=O)N(C)C(=N)N1
InChI Key InChIKey=LDILEPQPHIRRKQ-QFIPXVFZSA-N
Data  2 KI
  Tab Delimited (TSV)   2D SDfile   Computed 3D by Vconf -m prep SDfile
Find this compound or compounds like it in BindingDB:
Activity Spreadsheet -- Enzyme Inhibition Constant Data from BindingDB
Found 2 hits for monomerid = 243001
TargetBeta-secretase 1(Homo sapiens (Human))
Merck Sharp & Dohme
US Patent
LigandPNGBDBM243001(US9422277, 64)
Affinity DataKi:  160nM ΔG°:  -9.42kcal/molepH: 5.0 T: 2°C. Assay description: Varying concentrations of inhibitors at 3× the final desired concentration in a volume of 10 ul are preincubated with purified human BACE1 cata...
Ligand InfoPC cidPC sid
In DepthDetails US Patent
TargetBeta-secretase 2(Homo sapiens (Human))
Merck Sharp & Dohme
US Patent
LigandPNGBDBM243001(US9422277, 64)
Affinity DataKi:  356nM ΔG°:  -8.94kcal/molepH: 5.0 T: 2°C. Assay description: Inhibitor compounds, prepared at 3× the desired final concentration in 1×BACE assay buffer (20 mM sodium acetate pH 5.0, 10% glycerol, 0....
Ligand InfoPC cidPC sid
In DepthDetails US Patent