BDBM243019 US9422277, 82
SMILES CN1C(=N)N[C@@](C)(CS1(=O)=O)c1sc2c(cccc2c1F)-c1coc(n1)-c1ccc(F)cc1
InChI Key InChIKey=HAFFQZUPNWJFBP-QFIPXVFZSA-N
Data  2 KI
  Tab Delimited (TSV)   2D SDfile   Computed 3D by Vconf -m prep SDfile
Find this compound or compounds like it in BindingDB:
Activity Spreadsheet -- Enzyme Inhibition Constant Data from BindingDB
Found 2 hits for monomerid = 243019
TargetBeta-secretase 2(Homo sapiens (Human))
Merck Sharp & Dohme
US Patent
LigandPNGBDBM243019(US9422277, 82)
Affinity DataKi:  2.94E+3nM ΔG°:  -7.67kcal/molepH: 5.0 T: 2°C. Assay description: Inhibitor compounds, prepared at 3× the desired final concentration in 1×BACE assay buffer (20 mM sodium acetate pH 5.0, 10% glycerol, 0....
Ligand InfoPC cidPC sid
In DepthDetails US Patent
TargetBeta-secretase 1(Homo sapiens (Human))
Merck Sharp & Dohme
US Patent
LigandPNGBDBM243019(US9422277, 82)
Affinity DataKi:  4.89E+3nM ΔG°:  -7.36kcal/molepH: 5.0 T: 2°C. Assay description: Varying concentrations of inhibitors at 3× the final desired concentration in a volume of 10 ul are preincubated with purified human BACE1 cata...
Ligand InfoPC cidPC sid
In DepthDetails US Patent