BDBM243274 7-((3-(dimethylamino)-1- pyrrolidinyl)carbonyl)-3- (3,5-dimethyl-4-isoxazolyl)- 9-(methylsulfonyl)-9H- carbazole-1-carboxamide::US10053454, Example 18::US10196387, Example 18
SMILES CN(C)C1CCN(C1)C(=O)c1ccc2c(c1)n(c1c(cc(cc21)-c1c(C)noc1C)C(N)=O)S(C)(=O)=O
InChI Key InChIKey=GVXSQMBAJGJYCZ-UHFFFAOYSA-N
Data  3 IC50
  Tab Delimited (TSV)   2D SDfile   Computed 3D by Vconf -m prep SDfile
Find this compound or compounds like it in BindingDB:
Activity Spreadsheet -- Enzyme Inhibition Constant Data from BindingDB
Found 3 hits for monomerid = 243274
TargetBromodomain-containing protein 4(Homo sapiens (Human))
Bristol-Myers Squibb
US Patent
LigandPNGBDBM243274(7-((3-(dimethylamino)-1- pyrrolidinyl)carbonyl)-3-...)
Affinity DataIC50: <50nM. Assay description: The binding of compounds to bromodomain BRD4 (44-168), BRD4 (333-460), and BRD4 (1-477 or 44-460) was assessed using a time resolved fluorescent reso...
Ligand InfoPC cidPC sid
In DepthDetails US Patent
TargetBromodomain-containing protein 4(Homo sapiens (Human))
Bristol-Myers Squibb
US Patent
LigandPNGBDBM243274(7-((3-(dimethylamino)-1- pyrrolidinyl)carbonyl)-3-...)
Affinity DataIC50: <50nM. Assay description: The binding of compounds to bromodomain BRD4 (44-168), BRD4 (333-460), and BRD4 (1-477 or 44-460) was assessed using a time resolved fluorescent reso...
Ligand InfoPC cidPC sid
In DepthDetails US Patent
TargetBromodomain-containing protein 4(Homo sapiens (Human))
Bristol-Myers Squibb
US Patent
LigandPNGBDBM243274(7-((3-(dimethylamino)-1- pyrrolidinyl)carbonyl)-3-...)
Affinity DataIC50: <50nM. Assay description: The binding of compounds to bromodomain BRD4 (44-168), BRD4 (333-460), and BRD4 (1-477 or 44-460) was assessed using a time resolved fluorescent reso...
Ligand InfoPC cidPC sid
In DepthDetails US Patent