BDBM243452 US9427428, 16::US9433609, 16
SMILES CC[C@H](C)[C@H](NC(=O)OC)C(=O)N1CCC[C@H]1c1ncc([nH]1)-c1ccc2cc(ccc2c1)-c1ccc2[nH]c(nc2c1)[C@@H]1CCCN1C(=O)[C@@H](NC(=O)OC)C(C)C
InChI Key InChIKey=QSOJFGNBOSSTHL-BAXPHUFQSA-N
Data  19 EC50
  Tab Delimited (TSV)   2D SDfile   Computed 3D by Vconf -m prep SDfile
Find this compound or compounds like it in BindingDB:
Activity Spreadsheet -- Enzyme Inhibition Constant Data from BindingDB
Found 19 hits for monomerid = 243452
TargetGenome polyprotein [810-3010](Hepatitis C virus genotype 1b (isolate Con1) (HCV))
Janssen Ireland
US Patent
LigandPNGBDBM243452(US9427428, 16 | US9433609, 16)
Affinity DataEC50:  0.00300nM. Assay description: The assay utilized the stably transfected cell line Huh-7 luc/neo (hereafter referred to as Huh-Luc). This cell line harbors an RNA encoding a bicist...
Ligand InfoPC cidPC sid
In DepthDetails US Patent
TargetGenome polyprotein [1973-2419,Y2165C](Hepatitis C virus genotype 1b (isolate Con1) (HCV))
Janssen Ireland
US Patent
LigandPNGBDBM243452(US9427428, 16 | US9433609, 16)
Affinity DataEC50: <0.0130nM. Assay description: In a transient set-up, a Huh-7 lunet hepatoma cell line was transiently transfected with an autonomously replicating RNA encoding a bi-cistronic expr...
Ligand InfoPC cidPC sid
In DepthDetails US Patent
TargetGenome polyprotein [1973-2419,L2000T](Hepatitis C virus genotype 1b (isolate Con1) (HCV))
Janssen Ireland
US Patent
LigandPNGBDBM243452(US9427428, 16 | US9433609, 16)
Affinity DataEC50:  0.151nM. Assay description: In a transient set-up, a Huh-7 lunet hepatoma cell line was transiently transfected with an autonomously replicating RNA encoding a bi-cistronic expr...
Ligand InfoPC cidPC sid
In DepthDetails US Patent
TargetGenome polyprotein [1973-2419,R2002H](Hepatitis C virus genotype 1b (isolate Con1) (HCV))
Janssen Ireland
US Patent
LigandPNGBDBM243452(US9427428, 16 | US9433609, 16)
Affinity DataEC50:  0.0700nM. Assay description: In a transient set-up, a Huh-7 lunet hepatoma cell line was transiently transfected with an autonomously replicating RNA encoding a bi-cistronic expr...
Ligand InfoPC cidPC sid
In DepthDetails US Patent
TargetGenome polyprotein [1973-2419,L2003F](Hepatitis C virus genotype 1b (isolate Con1) (HCV))
Janssen Ireland
US Patent
LigandPNGBDBM243452(US9427428, 16 | US9433609, 16)
Affinity DataEC50:  0.0170nM. Assay description: In a transient set-up, a Huh-7 lunet hepatoma cell line was transiently transfected with an autonomously replicating RNA encoding a bi-cistronic expr...
Ligand InfoPC cidPC sid
In DepthDetails US Patent
TargetGenome polyprotein [1973-2419,L2003M](Hepatitis C virus genotype 1b (isolate Con1) (HCV))
Janssen Ireland
US Patent
LigandPNGBDBM243452(US9427428, 16 | US9433609, 16)
Affinity DataEC50:  0.0930nM. Assay description: In a transient set-up, a Huh-7 lunet hepatoma cell line was transiently transfected with an autonomously replicating RNA encoding a bi-cistronic expr...
Ligand InfoPC cidPC sid
In DepthDetails US Patent
TargetGenome polyprotein [1973-2419,L2003V](Hepatitis C virus genotype 1b (isolate Con1) (HCV))
Janssen Ireland
US Patent
LigandPNGBDBM243452(US9427428, 16 | US9433609, 16)
Affinity DataEC50:  0.411nM. Assay description: In a transient set-up, a Huh-7 lunet hepatoma cell line was transiently transfected with an autonomously replicating RNA encoding a bi-cistronic expr...
Ligand InfoPC cidPC sid
In DepthDetails US Patent
TargetGenome polyprotein [1973-2419,Y2165H](Hepatitis C virus genotype 1b (isolate Con1) (HCV))
Janssen Ireland
US Patent
LigandPNGBDBM243452(US9427428, 16 | US9433609, 16)
Affinity DataEC50:  0.343nM. Assay description: In a transient set-up, a Huh-7 lunet hepatoma cell line was transiently transfected with an autonomously replicating RNA encoding a bi-cistronic expr...
Ligand InfoPC cidPC sid
In DepthDetails US Patent
TargetGenome polyprotein [1973-2419,Y2165C](Hepatitis C virus genotype 1b (isolate Con1) (HCV))
Janssen Ireland
US Patent
LigandPNGBDBM243452(US9427428, 16 | US9433609, 16)
Affinity DataEC50: <0.0130nM. Assay description: In a transient set-up, a Huh-7 lunet hepatoma cell line was transiently transfected with an autonomously replicating RNA encoding a bi-cistronic expr...
Ligand InfoPC cidPC sid
In DepthDetails US Patent
TargetGenome polyprotein [1657-3010](Hepatitis C virus genotype 1b (isolate Con1) (HCV))
Janssen Ireland
US Patent
LigandPNGBDBM243452(US9427428, 16 | US9433609, 16)
Affinity DataEC50:  0.00300nM. Assay description: The assay utilized the stably transfected cell line Huh-7 luc/neo (hereafter referred to as Huh-Luc). This cell line harbors an RNA encoding a bicist...
Ligand InfoPC cidPC sid
In DepthDetails US Patent
TargetGenome polyprotein [1657-3010](Hepatitis C virus genotype 1b (isolate Con1) (HCV))
Janssen Ireland
US Patent
LigandPNGBDBM243452(US9427428, 16 | US9433609, 16)
Affinity DataEC50:  0.00300nM. Assay description: In a transient set-up, a Huh-7 lunet hepatoma cell line was transiently transfected with an autonomously replicating RNA encoding a bi-cistronic expr...
Ligand InfoPC cidPC sid
In DepthDetails US Patent
TargetGenome polyprotein [1657-3011](Hepatitis C virus genotype 1a (isolate H77) (HCV))
Janssen Ireland
US Patent
LigandPNGBDBM243452(US9427428, 16 | US9433609, 16)
Affinity DataEC50:  0.0980nM. Assay description: In a transient set-up, a Huh-7 lunet hepatoma cell line was transiently transfected with an autonomously replicating RNA encoding a bi-cistronic expr...
Ligand InfoPC cidPC sid
In DepthDetails US Patent
TargetGenome polyprotein [1973-2419,L2000T](Hepatitis C virus genotype 1b (isolate Con1) (HCV))
Janssen Ireland
US Patent
LigandPNGBDBM243452(US9427428, 16 | US9433609, 16)
Affinity DataEC50:  0.151nM. Assay description: In a transient set-up, a Huh-7 lunet hepatoma cell line was transiently transfected with an autonomously replicating RNA encoding a bi-cistronic expr...
Ligand InfoPC cidPC sid
In DepthDetails US Patent
TargetGenome polyprotein [1973-2419,R2002H](Hepatitis C virus genotype 1b (isolate Con1) (HCV))
Janssen Ireland
US Patent
LigandPNGBDBM243452(US9427428, 16 | US9433609, 16)
Affinity DataEC50:  0.0700nM. Assay description: In a transient set-up, a Huh-7 lunet hepatoma cell line was transiently transfected with an autonomously replicating RNA encoding a bi-cistronic expr...
Ligand InfoPC cidPC sid
In DepthDetails US Patent
TargetGenome polyprotein [1973-2419,L2003F](Hepatitis C virus genotype 1b (isolate Con1) (HCV))
Janssen Ireland
US Patent
LigandPNGBDBM243452(US9427428, 16 | US9433609, 16)
Affinity DataEC50:  0.0170nM. Assay description: In a transient set-up, a Huh-7 lunet hepatoma cell line was transiently transfected with an autonomously replicating RNA encoding a bi-cistronic expr...
Ligand InfoPC cidPC sid
In DepthDetails US Patent
TargetGenome polyprotein [1973-2419,L2003M](Hepatitis C virus genotype 1b (isolate Con1) (HCV))
Janssen Ireland
US Patent
LigandPNGBDBM243452(US9427428, 16 | US9433609, 16)
Affinity DataEC50:  0.0930nM. Assay description: In a transient set-up, a Huh-7 lunet hepatoma cell line was transiently transfected with an autonomously replicating RNA encoding a bi-cistronic expr...
Ligand InfoPC cidPC sid
In DepthDetails US Patent
TargetGenome polyprotein [1973-2419,L2003V](Hepatitis C virus genotype 1b (isolate Con1) (HCV))
Janssen Ireland
US Patent
LigandPNGBDBM243452(US9427428, 16 | US9433609, 16)
Affinity DataEC50:  0.411nM. Assay description: In a transient set-up, a Huh-7 lunet hepatoma cell line was transiently transfected with an autonomously replicating RNA encoding a bi-cistronic expr...
Ligand InfoPC cidPC sid
In DepthDetails US Patent
TargetGenome polyprotein [1973-2419,Y2165H](Hepatitis C virus genotype 1b (isolate Con1) (HCV))
Janssen Ireland
US Patent
LigandPNGBDBM243452(US9427428, 16 | US9433609, 16)
Affinity DataEC50:  0.343nM. Assay description: In a transient set-up, a Huh-7 lunet hepatoma cell line was transiently transfected with an autonomously replicating RNA encoding a bi-cistronic expr...
Ligand InfoPC cidPC sid
In DepthDetails US Patent
TargetGenome polyprotein [1027-3011](Hepatitis C virus genotype 1a (isolate H) (HCV))
Janssen Ireland
US Patent
LigandPNGBDBM243452(US9427428, 16 | US9433609, 16)
Affinity DataEC50:  0.0980nM. Assay description: In a transient set-up, a Huh-7 lunet hepatoma cell line was transiently transfected with an autonomously replicating RNA encoding a bi-cistronic expr...
Ligand InfoPC cidPC sid
In DepthDetails US Patent