BDBM243570 US9428456, 1.284
SMILES FC(F)(F)c1cccc(n1)C(=O)Nc1ccnc(CN2CCC(CC2)C(=O)NC2CCCCC2)n1
InChI Key InChIKey=BUEKMZAAXYBCJP-UHFFFAOYSA-N
Data  1 EC50
  Tab Delimited (TSV)   2D SDfile   Computed 3D by Vconf -m prep SDfile
Find this compound or compounds like it in BindingDB:
Activity Spreadsheet -- Enzyme Inhibition Constant Data from BindingDB
Found 1 hit for monomerid = 243570
TargetAtypical chemokine receptor 3(Homo sapiens (Human))
Actelion Pharmaceuticals
US Patent
LigandPNGBDBM243570(US9428456, 1.284)
Affinity DataEC50:  223nMT: 2°C. Assay description: CHO-K1 CXCR7 b-arrestin cells are detached from culture dishes with a cell dissociation buffer (Invitrogen, #13151-014) and collected in growing medi...
Ligand InfoPC cidPC sid
In DepthDetails US Patent