BDBM244108 US9428491, 1.6: 2HCl
SMILES COC(=O)N[C@H](C(C)C)C(=O)N1CCC[C@@H]1c1ncc([nH]1)C#CC#Cc1ccc2cc(ccc2c1)-c1cnc([nH]1)[C@H]1CCCN1C(=O)[C@H](NC(=O)OC)C(C)C
InChI Key InChIKey=SWOUEXFUTLUYMH-HHRPYJKCSA-N
Data  1 IC50
  Tab Delimited (TSV)   2D SDfile   Computed 3D by Vconf -m prep SDfile
Find this compound or compounds like it in BindingDB:
Activity Spreadsheet -- Enzyme Inhibition Constant Data from BindingDB
Found 1 hit for monomerid = 244108
TargetGenome polyprotein [1973-2419](Hepatitis C virus genotype 1b (isolate Con1) (HCV))
TBA
US Patent
LigandPNGBDBM244108(US9428491, 1.6: 2HCl)
Affinity DataIC50:  0.00460nMT: 2°C. Assay description: Solutions of the tested compounds in DMEM medium {DMEM) 1x; Source: Cellgro; Catalogue: 10-013-CV} were prepared immediately before use. Eleven seria...
Ligand InfoPC cidPC sid
In DepthDetails US Patent