BDBM244167 US9546173, cmpd 99::n-(1-(2-fluorobenzyl)-1h-pyrazol-4-yl)-2'-((tetrahydro-2h-pyran-4-yl)amino)spiro[cyclobutane-1,5'-pyrrolo[3,4-d]pyrimidine]-6'(7'h)-carboxamide
SMILES Fc1ccccc1Cn1cc(NC(=O)N2Cc3nc(NC4CCOCC4)ncc3C22CCC2)cn1
InChI Key InChIKey=OVNYQBBJZSXJKN-UHFFFAOYSA-N
Data  1 IC50
  Tab Delimited (TSV)   2D SDfile   Computed 3D by Vconf -m prep SDfile
Find this compound or compounds like it in BindingDB:
Activity Spreadsheet -- Enzyme Inhibition Constant Data from BindingDB
Found 1 hit for monomerid = 244167
TargetMitogen-activated protein kinase 1(Homo sapiens (Human))
Novartis
US Patent
LigandPNGBDBM244167(US9546173, cmpd 99 | n-(1-(2-fluorobenzyl)-1h-pyra...)
Affinity DataIC50:  12nMpH: 7.5Assay Description:Compound potency against activated ERK2 was determined using a kinase assay that measures ERK2-catalyzed phosphorylation of biotinylated ERKtide pept...
Ligand InfoPC cidPC sid
In DepthDetails US Patent