BDBM244530 US9428502, 139
SMILES Cc1nc(C#N)c([nH]1)-c1cc(ccc1C)C(=O)N1CC(C1)c1ccc(cc1)C#N
InChI Key InChIKey=SKQVEKYTXIKAFC-UHFFFAOYSA-N
Data  1 IC50
  Tab Delimited (TSV)   2D SDfile   Computed 3D by Vconf -m prep SDfile
Find this compound or compounds like it in BindingDB:
Activity Spreadsheet -- Enzyme Inhibition Constant Data from BindingDB
Found 1 hit for monomerid = 244530
TargetFatty acid synthase(Homo sapiens (Human))
3-V Biosciences
US Patent
LigandPNGBDBM244530(US9428502, 139)
Affinity DataIC50:  17nMT: 2°C. Assay description: The FASN enzyme was isolated from SKBr3 cells. SKBr3 is a human breast cancer cell-line with high levels of FASN expression. It is estimated that FAS...
Ligand InfoPC cidPC sid
In DepthDetails US Patent