BDBM244738 US10226449, cpd 348::US9428502, 348
SMILES COC(=O)N1CCC(C)(CC1)c1nc(Cl)c([nH]1)-c1cc(ccc1C)C(=O)N1CC(C1)c1ccc(cc1)C#N
InChI Key InChIKey=JNMAFPQUQHOOOA-UHFFFAOYSA-N
Data  2 IC50  1 EC50
  Tab Delimited (TSV)   2D SDfile   Computed 3D by Vconf -m prep SDfile
Find this compound or compounds like it in BindingDB:
Activity Spreadsheet -- Enzyme Inhibition Constant Data from BindingDB
Found 3 hits for monomerid = 244738
TargetFatty acid synthase(Homo sapiens (Human))
3-V Biosciences
US Patent
LigandPNGBDBM244738(US10226449, cpd 348 | US9428502, 348)
Affinity DataIC50:  14nMT: 2°C. Assay description: The FASN enzyme was isolated from SKBr3 cells. SKBr3 is a human breast cancer cell-line with high levels of FASN expression. It is estimated that FAS...
Ligand InfoPC cidPC sid
In DepthDetails US Patent
TargetGenome polyprotein(Hepatitis C Virus (Virus))
3-V Biosciences
US Patent
LigandPNGBDBM244738(US10226449, cpd 348 | US9428502, 348)
Affinity DataEC50:  2nM. Assay description: The antiviral activities of the compounds were assessed using the HCV1b replicon system. The replicon was constructed using the ET (luc-ubi-neo/ET) c...
Ligand InfoPC cidPC sid
In DepthDetails US Patent
TargetFatty acid synthase(Homo sapiens (Human))
3-V Biosciences
US Patent
LigandPNGBDBM244738(US10226449, cpd 348 | US9428502, 348)
Affinity DataIC50:  14nM. Assay description: FASN activity of the SKBr3 cell extract was determined by measuring either NADPH oxidation or the amount of thiol-containing coenzyme A (CoA) release...
Ligand InfoPC cidPC sid
In DepthDetails US Patent