BDBM244979 US9422293, 214
SMILES COC1CCCN(C1)c1nc2CCN(CCc2c(Nc2ccc(cc2)C(F)(F)F)n1)c1ncccc1C(F)(F)F
InChI Key InChIKey=GISRNLXZDAWYIN-UHFFFAOYSA-N
Data  2 IC50
  Tab Delimited (TSV)   2D SDfile   Computed 3D by Vconf -m prep SDfile
Find this compound or compounds like it in BindingDB:
Activity Spreadsheet -- Enzyme Inhibition Constant Data from BindingDB
Found 2 hits for monomerid = 244979
TargetTransient receptor potential cation channel subfamily V member 1(Rattus norvegicus (rat))
Janssen Pharmaceutica
US Patent
LigandPNGBDBM244979(US9422293, 214)
Affinity DataIC50:  10nMT: 2°C. Assay description: The assay was performed as described below, using HEK293 cells transfected with rat TRPV1 (rTRPV1/HEK293). These cells had a geneticin selection mark...
Ligand InfoPC cidPC sid
In DepthDetails US Patent
TargetTransient receptor potential cation channel subfamily V member 1(Homo sapiens (Human))
Janssen Pharmaceutica
US Patent
LigandPNGBDBM244979(US9422293, 214)
Affinity DataIC50:  10nMT: 2°C. Assay description: HEK293 cells were transfected with human TRPV1 cloned in pcDNA3.1zeo(+) using the Effectene non-liposomal lipid based transfection kit (Qiagen) (hTRP...
Ligand InfoPC cidPC sid
In DepthDetails US Patent