BDBM245219 US9428500, 13
SMILES CN1CCN(CC1)c1ccc(cc1)-c1ccc2[nH]c3nccc(\C=C\c4ccc(F)cc4)c3c2c1
InChI Key InChIKey=YQWWPVUMSDZFRU-GORDUTHDSA-N
Data  4 IC50
  Tab Delimited (TSV)   2D SDfile   Computed 3D by Vconf -m prep SDfile
Find this compound or compounds like it in BindingDB:
Activity Spreadsheet -- Enzyme Inhibition Constant Data from BindingDB
Found 4 hits for monomerid = 245219
TargetALK tyrosine kinase receptor(Homo sapiens (Human))
Universita Degli Studi Di Milano—Bicocca
US Patent
LigandPNGBDBM245219(US9428500, 13)
Affinity DataIC50:  370nMpH: 7.5 T: 2°C. Assay description: GST-tagged recombinant wild-type or L1196M mutated ALK kinase (rALK) was expressed in Sf9 insect cells using the pBacPAK baculovirus vector system (C...
Ligand InfoPC cidPC sid
In DepthDetails US Patent
TargetALK tyrosine kinase receptor(Homo sapiens (Human))
Universita Degli Studi Di Milano—Bicocca
US Patent
LigandPNGBDBM245219(US9428500, 13)
Affinity DataIC50:  370nM. Assay description: Inhibition of recombinant GST-tagged wild type ALK (1064 to 1427 residues) (unknown origin) expressed in Sf9 cells using TMB peptide as substrate pre...
Ligand InfoPC cidPC sid
In DepthDetails PubMed
TargetALK tyrosine kinase receptor(Homo sapiens (Human))
Universita Degli Studi Di Milano—Bicocca
US Patent
LigandPNGBDBM245219(US9428500, 13)
Affinity DataIC50:  91nM. Assay description: Inhibition of recombinant GST-tagged ALK L1196M mutant (1064 to 1427 residues) (unknown origin) expressed in Sf9 cells using TMB peptide as substrate...
Ligand InfoPC cidPC sid
In DepthDetails PubMed
TargetALK tyrosine kinase receptor [L1196M](Homo sapiens (Human))
Universita Degli Studi Di Milano—Bicocca
US Patent
LigandPNGBDBM245219(US9428500, 13)
Affinity DataIC50:  91nMpH: 7.5 T: 2°C. Assay description: GST-tagged recombinant wild-type or L1196M mutated ALK kinase (rALK) was expressed in Sf9 insect cells using the pBacPAK baculovirus vector system (C...
Ligand InfoPC cidPC sid
In DepthDetails US Patent