BDBM245291 US9428504, 29
SMILES CC(C)(C)CN1CCC2(CN(c3c2c(ccc3O)C(F)(F)F)c2ccccc2NC(=O)Nc2nccs2)CC1
InChI Key InChIKey=LQDVPXGJPCTPAS-UHFFFAOYSA-N
Data  1 KI
  Tab Delimited (TSV)   2D SDfile   Computed 3D by Vconf -m prep SDfile
Find this compound or compounds like it in BindingDB:
Activity Spreadsheet -- Enzyme Inhibition Constant Data from BindingDB
Found 1 hit for monomerid = 245291
TargetP2Y purinoceptor 1(Homo sapiens (Human))
Bristol-Myers Squibb
US Patent
LigandPNGBDBM245291(US9428504, 29)
Affinity DataKi:  6.40nM ΔG°:  -11.2kcal/molepH: 7.4 T: 2°C. Assay description: A SPA membrane binding assay was used to identify inhibitors of [33P] 2MeS-ADP binding to cloned human P2Y1 receptors (The P2Y1 receptor membranes we...
Ligand InfoPC cidPC sid
In DepthDetails US Patent