BDBM245301 US9428504, 41
SMILES COC(=O)c1ccc2nc(NC(=O)Nc3ccccc3N3CC4(CCN(CC(C)(C)C)CC4)c4c3c(O)ccc4Cl)sc2c1
InChI Key InChIKey=GFKQHJKLLVDRBF-UHFFFAOYSA-N
Data  1 KI
  Tab Delimited (TSV)   2D SDfile   Computed 3D by Vconf -m prep SDfile
Find this compound or compounds like it in BindingDB:
Activity Spreadsheet -- Enzyme Inhibition Constant Data from BindingDB
Found 1 hit for monomerid = 245301
TargetP2Y purinoceptor 1(Homo sapiens (Human))
Bristol-Myers Squibb
US Patent
LigandPNGBDBM245301(US9428504, 41)
Affinity DataKi:  7.20nM ΔG°:  -11.1kcal/molepH: 7.4 T: 2°C. Assay description: A SPA membrane binding assay was used to identify inhibitors of [33P] 2MeS-ADP binding to cloned human P2Y1 receptors (The P2Y1 receptor membranes we...
Ligand InfoPC cidPC sid
In DepthDetails US Patent