BDBM24539 (3Z)-N-[(4-chlorophenyl)methyl]-3-[2-(2-nitrophenyl)hydrazin-1-ylidene]-2-oxo-2,3-dihydro-1H-indole-5-sulfonamide::Oxindole scaffold, 10d
SMILES [O-][N+](=O)c1ccccc1NN=C1C(=O)Nc2ccc(cc12)S(=O)(=O)NCc1ccc(Cl)cc1
InChI Key InChIKey=AVRGOCDNYXWVMM-UHFFFAOYSA-N
Data  3 IC50
  Tab Delimited (TSV)   2D SDfile   Computed 3D by Vconf -m prep SDfile
Find this compound or compounds like it in BindingDB:
Activity Spreadsheet -- Enzyme Inhibition Constant Data from BindingDB
Found 3 hits for monomerid = 24539
TargetTyrosine-protein phosphatase non-receptor type 11 [205-593](Homo sapiens (Human))
Moffitt Cancer Center
LigandPNGBDBM24539((3Z)-N-[(4-chlorophenyl)methyl]-3-[2-(2-nitropheny...)
Affinity DataIC50:  4.40E+3nMpH: 7.0 T: 2°C. Assay description: PTP activity was measured in a black 96-well plate. Reaction was initiated by addition of the substrate DiFMUP to enzyme mixtures containing test com...
In DepthDetails ArticlePubMed
TargetTyrosine-protein phosphatase non-receptor type 1(Homo sapiens (Human))
Moffitt Cancer Center
LigandPNGBDBM24539((3Z)-N-[(4-chlorophenyl)methyl]-3-[2-(2-nitropheny...)
Affinity DataIC50:  9.80E+3nM. Assay description: PTP activity was measured in a black 96-well plate. Reaction was initiated by addition of the substrate DiFMUP to enzyme mixtures containing test com...
In DepthDetails ArticlePubMed
TargetTyrosine-protein phosphatase non-receptor type 6 [205-595](Homo sapiens (Human))
Moffitt Cancer Center
LigandPNGBDBM24539((3Z)-N-[(4-chlorophenyl)methyl]-3-[2-(2-nitropheny...)
Affinity DataIC50:  4.09E+4nMpH: 7.0 T: 2°C. Assay description: PTP activity was measured in a black 96-well plate. Reaction was initiated by addition of the substrate DiFMUP to enzyme mixtures containing test com...
In DepthDetails ArticlePubMed