BDBM245424 US9428469, 5
SMILES Clc1ccc(CNc2nc(Nc3cc(Cl)cc(Cl)c3)n[nH]2)nc1
InChI Key InChIKey=TWUYFPXBAMSZDA-UHFFFAOYSA-N
Data  1 EC50
  Tab Delimited (TSV)   2D SDfile   Computed 3D by Vconf -m prep SDfile
Find this compound or compounds like it in BindingDB:
Activity Spreadsheet -- Enzyme Inhibition Constant Data from BindingDB
Found 1 hit for monomerid = 245424
TargetGenome polyprotein [192-746](Hepatitis C virus genotype 1b (isolate Con1) (HCV))
F. Hoffmann-La Roche
US Patent
LigandPNGBDBM245424(US9428469, 5)
Affinity DataEC50:  1.57E+3nMT: 2°C. Assay description: Huh7-high CD81 cells were plated at a cell density of 8000 cells per well in 96 well plates (Perkin Elmer, cat #6005660). Cells were plated in 100 &m...
Ligand InfoPC cidPC sid
In DepthDetails US Patent