BDBM24564 2-{[4-chloro-6-(quinolin-6-ylamino)pyrimidin-2-yl]sulfanyl}octanoic acid::CHEMBL459721::Pirinixic acid-based compound, 6c
SMILES CCCCCCC(Sc1nc(Cl)cc(Nc2ccc3ncccc3c2)n1)C(O)=O
InChI Key InChIKey=DLURBYNSENSGOL-UHFFFAOYSA-N
Data  5 IC50
  Tab Delimited (TSV)   2D SDfile   Computed 3D by Vconf -m prep SDfile
Find this compound or compounds like it in BindingDB:
Activity Spreadsheet -- Enzyme Inhibition Constant Data from BindingDB
Found 5 hits for monomerid = 24564
TargetPolyunsaturated fatty acid 5-lipoxygenase(Homo sapiens (Human))
Eberhard Karls University Tuebingen
LigandPNGBDBM24564(2-{[4-chloro-6-(quinolin-6-ylamino)pyrimidin-2-yl]...)
Affinity DataIC50:  3.40E+4nMpH: 7.4 T: 2°C. Assay description: For determination of the activity of 5-LO in 100000g supernatants, aliquots of the supernatants were added to reaction mix, and were preincubated wit...
In DepthDetails ArticlePubMed
TargetPeroxisome proliferator-activated receptor alpha(Homo sapiens (Human))
Goethe-University Frankfurt
Curated by ChEMBL
LigandPNGBDBM24564(2-{[4-chloro-6-(quinolin-6-ylamino)pyrimidin-2-yl]...)
Affinity DataIC50:  2.20E+3nM. Assay description: Activation of human PPARalpha ligand binding domain expressed in COS7 cells by luciferase reporter gene assay
In DepthDetails ArticlePubMed
TargetProstaglandin G/H synthase 2(Homo sapiens (Human))
Eberhard Karls University Tuebingen
Curated by ChEMBL
LigandPNGBDBM24564(2-{[4-chloro-6-(quinolin-6-ylamino)pyrimidin-2-yl]...)
Affinity DataIC50: >10nM. Assay description: Inhibition of human recombinant COX2
In DepthDetails ArticlePubMed
TargetProstaglandin G/H synthase 1(Ovis aries (Sheep))
Eberhard Karls University Tuebingen
Curated by ChEMBL
LigandPNGBDBM24564(2-{[4-chloro-6-(quinolin-6-ylamino)pyrimidin-2-yl]...)
Affinity DataIC50: >10nM. Assay description: Inhibition of ovine COX1
In DepthDetails ArticlePubMed
TargetPeroxisome proliferator-activated receptor gamma(Homo sapiens (Human))
Goethe-University Frankfurt
Curated by ChEMBL
LigandPNGBDBM24564(2-{[4-chloro-6-(quinolin-6-ylamino)pyrimidin-2-yl]...)
Affinity DataIC50:  3.50E+3nM. Assay description: Activation of human PPARgamma ligand binding domain expressed in COS7 cells by luciferase reporter gene assay
In DepthDetails ArticlePubMed