BDBM245888 US9428514, 76
SMILES CCOc1cc(=O)n(C)cc1-c1cc(ccc1Oc1ccc(F)cc1F)N(CC1CC1)S(=O)(=O)Cc1ccccc1
InChI Key InChIKey=JRSYZDSFRNNVRW-UHFFFAOYSA-N
Data  2 KI
  Tab Delimited (TSV)   2D SDfile   Computed 3D by Vconf -m prep SDfile
Find this compound or compounds like it in BindingDB:
Activity Spreadsheet -- Enzyme Inhibition Constant Data from BindingDB
Found 2 hits for monomerid = 245888
TargetBromodomain-containing protein 4 [352-457](Homo sapiens (Human))
Abbvie
US Patent
LigandPNGBDBM245888(US9428514, 76)
Affinity DataKi:  13.1nM ΔG°:  -10.7kcal/molepH: 6.0 T: 2°C. Assay description: Assay method C: Compound dilution series were prepared in DMSO via an approximately 3-fold serial dilution from one of the following: 0.047 mM to 0.7...
Ligand InfoPC cidPC sid
In DepthDetails US Patent
TargetBromodomain-containing protein 4 [57-168](Homo sapiens (Human))
Abbvie
US Patent
LigandPNGBDBM245888(US9428514, 76)
Affinity DataKi:  1.04E+3nM ΔG°:  -8.16kcal/molepH: 6.0 T: 2°C. Assay description: Assay method C: Compound dilution series were prepared in DMSO via an approximately 3-fold serial dilution from one of the following: 0.047 mM to 0.7...
Ligand InfoPC cidPC sid
In DepthDetails US Patent