BDBM246170 US10183932, Example 75::US9434690, 75::US9822102, Example 75
SMILES CCC(C(=O)Nc1ccc2[nH]c(cc2c1)C(O)=O)n1cc(OC)c(cc1=O)-c1cc(Cl)ccc1C#N
InChI Key
Data  6 IC50
  Tab Delimited (TSV)   2D SDfile   Computed 3D by Vconf -m prep SDfile
Find this compound or compounds like it in BindingDB:
Activity Spreadsheet -- Enzyme Inhibition Constant Data from BindingDB
Found 6 hits for monomerid = 246170
TargetCoagulation factor XI(Homo sapiens (Human))
Bayer Pharma Aktiengesellschaft
US Patent
LigandPNGBDBM246170(US10183932, Example 75 | US9434690, 75 | US9822102...)
Affinity DataIC50:  4.30nMpH: 7.4 T: 2°C. Assay description: Test substances are dissolved in dimethyl sulphoxide and serially diluted in dimethyl sulphoxide (3000 μM to 0.0078 μM; resulting final con...
Ligand InfoPC cidPC sid
In DepthDetails US Patent
TargetPlasma kallikrein(Homo sapiens (Human))
Bayer Pharma Aktiengesellschaft
US Patent
LigandPNGBDBM246170(US10183932, Example 75 | US9434690, 75 | US9822102...)
Affinity DataIC50:  28nMpH: 7.4 T: 2°C. Assay description: Test substances are dissolved in dimethyl sulphoxide and serially diluted in dimethyl sulphoxide (3000 μM to 0.0078 μM; resulting final con...
Ligand InfoPC cidPC sid
In DepthDetails US Patent
TargetPlasma kallikrein(Homo sapiens (Human))
Bayer Pharma Aktiengesellschaft
US Patent
LigandPNGBDBM246170(US10183932, Example 75 | US9434690, 75 | US9822102...)
Affinity DataIC50:  28nM. Assay description: Test substances are dissolved in dimethyl sulphoxide and serially diluted in dimethyl sulphoxide (3000 μM to 0.0078 μM; resulting final con...
Ligand InfoPC cidPC sid
In DepthDetails US Patent
TargetCoagulation factor XI(Homo sapiens (Human))
Bayer Pharma Aktiengesellschaft
US Patent
LigandPNGBDBM246170(US10183932, Example 75 | US9434690, 75 | US9822102...)
Affinity DataIC50:  28nM. Assay description: To determine the factor XIa inhibition of the substances according to the invention, a biochemical test system is used which utilizes the reaction of...
Ligand InfoPC cidPC sid
In DepthDetails US Patent
TargetCoagulation factor XI(Homo sapiens (Human))
Bayer Pharma Aktiengesellschaft
US Patent
LigandPNGBDBM246170(US10183932, Example 75 | US9434690, 75 | US9822102...)
Affinity DataIC50:  4.30nM. Assay description: Test substances are dissolved in dimethyl sulphoxide and serially diluted in dimethyl sulphoxide (3000 μM to 0.0078 μM; resulting final con...
Ligand InfoPC cidPC sid
In DepthDetails US Patent
TargetCoagulation factor XI(Homo sapiens (Human))
Bayer Pharma Aktiengesellschaft
US Patent
LigandPNGBDBM246170(US10183932, Example 75 | US9434690, 75 | US9822102...)
Affinity DataIC50:  4.30nM. Assay description: To determine the factor XIa inhibition of the substances according to the invention, a biochemical test system is used which utilizes the reaction of...
Ligand InfoPC cidPC sid
In DepthDetails US Patent