BDBM24618 CG-001::N-hydroxy-4-[2-(phenylformamido)ethoxy]benzamide
SMILES ONC(=O)c1ccc(OCCNC(=O)c2ccccc2)cc1
InChI Key InChIKey=GXOFMHYSDHBUFQ-UHFFFAOYSA-N
Data  1 KI
  Tab Delimited (TSV)   2D SDfile   Computed 3D by Vconf -m prep SDfile
Find this compound or compounds like it in BindingDB:
Activity Spreadsheet -- Enzyme Inhibition Constant Data from BindingDB
Found 1 hit for monomerid = 24618
TargetHistone deacetylase 1(Homo sapiens (Human))
Celera Genomics
LigandPNGBDBM24618(CG-001 | N-hydroxy-4-[2-(phenylformamido)ethoxy]be...)
Affinity DataKi:  43nM ΔG°:  -9.94kcal/molepH: 7.4 T: 2°C. Assay description: HDAC activity was measured using a continuous trypsin-coupled assay. For inhibitor characterization, measurements were done using 96-well assay plat...
In DepthDetails ArticlePubMed