BDBM246346 US9434693, 41
SMILES COc1ccccc1-n1nc(OC2CC(C)(C)C(=O)C(C)(C)C2)cc1-c1ccc(Cl)cc1
InChI Key InChIKey=OSYITGFTDTWGJW-UHFFFAOYSA-N
Data  1 IC50
  Tab Delimited (TSV)   2D SDfile   Computed 3D by Vconf -m prep SDfile
Find this compound or compounds like it in BindingDB:
Activity Spreadsheet -- Enzyme Inhibition Constant Data from BindingDB
Found 1 hit for monomerid = 246346
LigandPNGBDBM246346(US9434693, 41)
Affinity DataIC50:  9.70nM. Assay description: Calcium mobilization responses to KCl depolarization were evaluated by measuring the intensity of calcium-mediated fluorescent signal in the presence...
Ligand InfoPC cidPC sid
In DepthDetails US Patent