BDBM246355 US9446044, 19
SMILES Fc1cc(Br)ccc1Nc1ncnc2ccc3nc(sc3c12)C(=N)NCc1ccncc1
InChI Key InChIKey=FBLSZOZZFJDUBB-UHFFFAOYSA-N
Data  1 IC50
  Tab Delimited (TSV)   2D SDfile   Computed 3D by Vconf -m prep SDfile
Find this compound or compounds like it in BindingDB:
Activity Spreadsheet -- Enzyme Inhibition Constant Data from BindingDB
Found 1 hit for monomerid = 246355
TargetDual specificity tyrosine-phosphorylation-regulated kinase 1A(Homo sapiens (Human))
Diaxonhit
US Patent
LigandPNGBDBM246355(US9446044, 19)
Affinity DataIC50:  5.50E+3nMpH: 7.5 T: 2°C. Assay description: The DYRK1A and DYRK1B kinase assays to determine IC50 values were performed by Reaction Biology Corporation using HotSpot technology Worldwide websit...
Ligand InfoPC cidPC sid
In DepthDetails US Patent