BDBM24636 N-phenyl-1H-pyrazole-3-carboxamide::pyrazole amide, 15
SMILES O=C(Nc1ccccc1)c1ccn[nH]1
InChI Key InChIKey=WMZYZYFPPQOFKY-UHFFFAOYSA-N
Data  1 IC50
PDB links: 1 PDB ID matches this monomer.
  Tab Delimited (TSV)   2D SDfile   Computed 3D by Vconf -m prep SDfile
Find this compound or compounds like it in BindingDB:
Activity Spreadsheet -- Enzyme Inhibition Constant Data from BindingDB
Found 1 hit for monomerid = 24636
TargetCyclin-A2/Cyclin-dependent kinase 2(Homo sapiens (Human))
Astex
LigandPNGBDBM24636(N-phenyl-1H-pyrazole-3-carboxamide | pyrazole amid...)
Affinity DataIC50:  9.70E+4nMpH: 7.2 T: 2°C. Assay description: CDK2/cyclin A activity was determined using a radiometric assay to measure the incorporation of gamma-phosphate from [gamma-33P]-ATP into histone H1....