BDBM24640 N-(4-fluorophenyl)-4-(2-hydroxyacetamido)-1H-pyrazole-3-carboxamide::pyrazole diamide, 19
SMILES OCC(=O)Nc1cn[nH]c1C(=O)Nc1ccc(F)cc1
InChI Key InChIKey=XPWCZMMPBBEBJG-UHFFFAOYSA-N
Data  1 IC50
  Tab Delimited (TSV)   2D SDfile   Computed 3D by Vconf -m prep SDfile
Find this compound or compounds like it in BindingDB:
Activity Spreadsheet -- Enzyme Inhibition Constant Data from BindingDB
Found 1 hit for monomerid = 24640
TargetCyclin-A2/Cyclin-dependent kinase 2(Homo sapiens (Human))
Astex
LigandPNGBDBM24640(N-(4-fluorophenyl)-4-(2-hydroxyacetamido)-1H-pyraz...)
Affinity DataIC50:  730nMpH: 7.2 T: 2°C. Assay description: CDK2/cyclin A activity was determined using a radiometric assay to measure the incorporation of gamma-phosphate from [gamma-33P]-ATP into histone H1....
In DepthDetails ArticlePubMed