BDBM246400 US9446130, 13
SMILES CCn1ncc2[C@H](CCCc12)n1nc(-c2ccc(cc2)C(=O)Nc2cc(ccn2)C(F)(F)F)c2c(N)ncnc12
InChI Key InChIKey=XUGLPQLPXHJNHB-FQEVSTJZSA-N
Data  1 IC50
  Tab Delimited (TSV)   2D SDfile   Computed 3D by Vconf -m prep SDfile
Find this compound or compounds like it in BindingDB:
Activity Spreadsheet -- Enzyme Inhibition Constant Data from BindingDB
Found 1 hit for monomerid = 246400
TargetTyrosine-protein kinase BTK(Homo sapiens (Human))
Merck Sharp & Dohme
US Patent
LigandPNGBDBM246400(US9446130, 13)
Affinity DataIC50:  5.90nM. Assay description: Assay Method B: BTK enzymatic activity was determined with the LANCE (Lanthanide Chelate Excite) TR-FRET (Time-resolved fluorescence resonance energy...
Ligand InfoPC cidPC sid
In DepthDetails US Patent