BDBM246583 4-((2,5-Dioxocyclopentylidene)methylamino)benzenesulfonamide (2h)
SMILES [#7]S(=O)(=O)c1ccc(-[#7]\[#6]=[#6]-2\[#6](=O)-[#6]-[#6]-[#6]-2=O)cc1
InChI Key InChIKey=VTOOXCLGJXDDDL-UHFFFAOYSA-N
Data  2 IC50
  Tab Delimited (TSV)   2D SDfile   Computed 3D by Vconf -m prep SDfile
Find this compound or compounds like it in BindingDB:
Activity Spreadsheet -- Enzyme Inhibition Constant Data from BindingDB
Found 2 hits for monomerid = 246583
TargetCarbonic anhydrase 2(Homo sapiens (Human))
Sakarya University
LigandPNGBDBM246583(4-((2,5-Dioxocyclopentylidene)methylamino)benzenes...)
Affinity DataIC50:  3.36E+3nM. Assay description: For the inhibition studies of sulfonamide, different concentrations of these compounds were added to the enzyme. Activity percentage values of CA for...
Ligand InfoPC cidPC sid
In DepthDetails ArticlePubMed
TargetCarbonic anhydrase 1(Homo sapiens (Human))
Sakarya University
LigandPNGBDBM246583(4-((2,5-Dioxocyclopentylidene)methylamino)benzenes...)
Affinity DataIC50:  4.80E+3nM. Assay description: For the inhibition studies of sulfonamide, different concentrations of these compounds were added to the enzyme. Activity percentage values of CA for...
Ligand InfoPC cidPC sid
In DepthDetails ArticlePubMed