BDBM246610 CA IX inhibitor, (B)2
SMILES NS(=O)(=O)c1ccc(CCNC(=O)C[N+]23CC(=O)O[Re-]2(C=O)(C=O)(C=O)[n+]2ccccc2C3)cc1
InChI Key InChIKey=NKWJKLUEHOQPJX-UHFFFAOYSA-M
Data  1 KI
  Tab Delimited (TSV)   2D SDfile   Computed 3D by Vconf -m prep SDfile
Find this compound or compounds like it in BindingDB:
Activity Spreadsheet -- Enzyme Inhibition Constant Data from BindingDB
Found 1 hit for monomerid = 246610
TargetCarbonic anhydrase 9(Homo sapiens (Human))
Bc Cancer Agency
LigandPNGBDBM246610(CA IX inhibitor, (B)2)
Affinity DataKi:  58nM. Assay description: The inhibition constants (Ki) of FEC to four human CA isoenzymes I, II, IX and XII were determined by CA catalyzed CO2 hydration assays following pre...
Ligand InfoPC cidPC sid
In DepthDetails ArticlePubMed