BDBM246993 ({4-[4-(2-{[(3R,3aR,6R,6aR)-6-Hydroxy-hexahydrofuro[3,2-b]furan-3-yl]oxy}-6-chloro-3H-imidazo[4,5-b]pyridin-5-yl)phenyl]-2,6-difluorophenyl}imino)dimethyl-λ6-sulfanone::US10053471, 4
SMILES CS(C)(=O)=Nc1c(F)cc(cc1F)-c1ccc(cc1)-c1nc2[nH]c(O[C@@H]3CO[C@@H]4[C@H](O)CO[C@H]34)nc2cc1Cl
InChI Key
Data  1 EC50
  Tab Delimited (TSV)   2D SDfile   Computed 3D by Vconf -m prep SDfile
Find this compound or compounds like it in BindingDB:
Activity Spreadsheet -- Enzyme Inhibition Constant Data from BindingDB
Found 1 hit for monomerid = 246993
Target5'-AMP-activated protein kinase catalytic subunit alpha-1/subunit beta-1/subunit gamma-1(Homo sapiens (Human))
Boehringer Ingelheim International
US Patent
LigandPNGBDBM246993(({4-[4-(2-{[(3R,3aR,6R,6aR)-6-Hydroxy-hexahydrofur...)
Affinity DataEC50:  3.56E+3nMpH: 7.0 T: 2°C. Assay description: The test compounds were dissolved in 100% DMSO at a concentration of 10 mM and in a first step diluted in DMSO to a concentration of 5 mM, followed b...
Ligand InfoPC cidPC sid
In DepthDetails US Patent