BDBM247030 5-(1H-pyrazol-4-yl)-1-((1-(pyridin-3-ylsulfonyl)piperidin-4-yl)methyl)-1H-indole::US9701663, 38
SMILES O=S(=O)(N1CCC(Cn2ccc3cc(ccc23)-c2cn[nH]c2)CC1)c1cccnc1
InChI Key InChIKey=FOZIMNUTGJKVCT-UHFFFAOYSA-N
Data  4 IC50
  Tab Delimited (TSV)   2D SDfile   Computed 3D by Vconf -m prep SDfile
Find this compound or compounds like it in BindingDB:
Activity Spreadsheet -- Enzyme Inhibition Constant Data from BindingDB
Found 4 hits for monomerid = 247030
TargetInterleukin-17A(Homo sapiens (Human))
Innov17
US Patent
LigandPNGBDBM247030(5-(1H-pyrazol-4-yl)-1-((1-(pyridin-3-ylsulfonyl)pi...)
Affinity DataIC50: <1.00E+4nM. Assay description: Peripheral blood mononuclear cells (PBMCs) were sourced from freshly prepared leukocyte enriched plasma (buffy coat) from healthy donors (New York Bl...
Ligand InfoPC cidPC sid
In DepthDetails US Patent
TargetInterleukin-21(Homo sapiens (Human))
Innov17
US Patent
LigandPNGBDBM247030(5-(1H-pyrazol-4-yl)-1-((1-(pyridin-3-ylsulfonyl)pi...)
Affinity DataIC50: <1.00E+4nM
Ligand InfoPC cidPC sid
In DepthDetails US Patent
TargetInterleukin-22(Homo sapiens (Human))
Innov17
US Patent
LigandPNGBDBM247030(5-(1H-pyrazol-4-yl)-1-((1-(pyridin-3-ylsulfonyl)pi...)
Affinity DataIC50: <1.00E+4nM
Ligand InfoPC cidPC sid
In DepthDetails US Patent
TargetInterleukin-17F(Homo sapiens (Human))
Innov17
US Patent
LigandPNGBDBM247030(5-(1H-pyrazol-4-yl)-1-((1-(pyridin-3-ylsulfonyl)pi...)
Affinity DataIC50: <1.00E+4nM
Ligand InfoPC cidPC sid
In DepthDetails US Patent