BDBM247032 US9701663, 47::rac.-cis-1-((-5-methyl-1-(phenylsulfonyl)pyrrolidin-3-yl)methyl)-5-(1H-pyrazol-4-yl)-1H-indole
SMILES C[C@@H]1CC(Cn2ccc3cc(ccc23)-c2cn[nH]c2)CN1S(=O)(=O)c1ccccc1
InChI Key
Data  3 IC50
  Tab Delimited (TSV)   2D SDfile   Computed 3D by Vconf -m prep SDfile
Find this compound or compounds like it in BindingDB:
Activity Spreadsheet -- Enzyme Inhibition Constant Data from BindingDB
Found 3 hits for monomerid = 247032
TargetInterleukin-17A(Homo sapiens (Human))
Innov17
US Patent
LigandPNGBDBM247032(US9701663, 47 | rac.-cis-1-((-5-methyl-1-(phenylsu...)
Affinity DataIC50: <1.00E+4nM. Assay description: Peripheral blood mononuclear cells (PBMCs) were sourced from freshly prepared leukocyte enriched plasma (buffy coat) from healthy donors (New York Bl...
Ligand InfoPC cidPC sid
In DepthDetails US Patent
TargetInterleukin-21(Homo sapiens (Human))
Innov17
US Patent
LigandPNGBDBM247032(US9701663, 47 | rac.-cis-1-((-5-methyl-1-(phenylsu...)
Affinity DataIC50: <1.00E+4nM
Ligand InfoPC cidPC sid
In DepthDetails US Patent
TargetInterleukin-17F(Homo sapiens (Human))
Innov17
US Patent
LigandPNGBDBM247032(US9701663, 47 | rac.-cis-1-((-5-methyl-1-(phenylsu...)
Affinity DataIC50: <1.00E+4nM
Ligand InfoPC cidPC sid
In DepthDetails US Patent