BDBM247219 US9434733, 7-tetrahydropyran-4-yl-2-[[3-[5-(trifluoromethyl)-2-pyridyl]azetidin-1-yl]methyl]-3H-imidazo[5,1-f][1,2,4]triazin-4-one::US9533992, 7-tetrahydropyran-4-yl-2-[[3-[5-(trifluoromethyl)-2-pyridyl]azetidin-1-yl]methyl]-3H-imidazo[5,1-f][1,2,4]triazin-4-one
SMILES FC(F)(F)c1ccc(nc1)C1CN(Cc2nn3c(ncc3c(=O)[nH]2)C2CCOCC2)C1
InChI Key InChIKey=HMCYSUZCPUZNSN-UHFFFAOYSA-N
Data  3 IC50
  Tab Delimited (TSV)   2D SDfile   Computed 3D by Vconf -m prep SDfile
Find this compound or compounds like it in BindingDB:
Activity Spreadsheet -- Enzyme Inhibition Constant Data from BindingDB
Found 3 hits for monomerid = 247219
TargetHigh affinity cGMP-specific 3',5'-cyclic phosphodiesterase 9A(Homo sapiens (Human))
H. Lundbeck
US Patent
LigandPNGBDBM247219(US9434733, 7-tetrahydropyran-4-yl-2-[[3-[5-(triflu...)
Affinity DataIC50:  560nMT: 2°C. Assay description: A PDE9 assay may for example, be performed as follows: The assay is performed in 60 uL samples containing a fixed amount of the relevant PDE enzyme (...
Ligand InfoPC cidPC sid
In DepthDetails US Patent
TargetHigh affinity cGMP-specific 3',5'-cyclic phosphodiesterase 9A(Homo sapiens (Human))
H. Lundbeck
US Patent
LigandPNGBDBM247219(US9434733, 7-tetrahydropyran-4-yl-2-[[3-[5-(triflu...)
Affinity DataIC50:  560nMpH: 7.6 T: 2°C. Assay description: A PDE9 assay may for example, be performed as follows: The assay is performed in 60 uL samples containing a fixed amount of the relevant PDE enzyme (...
Ligand InfoPC cidPC sid
In DepthDetails US Patent
TargetHigh affinity cGMP-specific 3',5'-cyclic phosphodiesterase 9A(Homo sapiens (Human))
H. Lundbeck
US Patent
LigandPNGBDBM247219(US9434733, 7-tetrahydropyran-4-yl-2-[[3-[5-(triflu...)
Affinity DataIC50:  560nMpH: 7.6 T: 2°C. Assay description: A PDE9 assay may for example, be performed as follows: The assay is performed in 60 uL samples containing a fixed amount of the relevant PDE enzyme (...
Ligand InfoPC cidPC sid
In DepthDetails US Patent