BDBM24724 (adamantan-1-ylmethyl)({3-[(7-chloroquinolin-4-yl)amino]propyl})amine::4-Aminoquinoline, 21
SMILES Clc1ccc2c(NCCCNCC34CC5CC(CC(C5)C3)C4)ccnc2c1
InChI Key InChIKey=JPSMOGYAVYUWKI-UHFFFAOYSA-N
Data  2 IC50
  Tab Delimited (TSV)   2D SDfile   Computed 3D by Vconf -m prep SDfile
Find this compound or compounds like it in BindingDB:
Activity Spreadsheet -- Enzyme Inhibition Constant Data from BindingDB
Found 2 hits for monomerid = 24724
TargetAcetylcholinesterase(Homo sapiens (Human))
Central University Of Punjab
Curated by ChEMBL
LigandPNGBDBM24724((adamantan-1-ylmethyl)({3-[(7-chloroquinolin-4-yl)...)
Affinity DataIC50:  500nM. Assay description: Inhibition of recombinant human AChE using acetylthiocholine as substrate by Ellman's method
In DepthDetails PubMed
TargetBotulinum neurotoxin type A2 [1-425](Clostridium botulinum)
University Of Belgrade
LigandPNGBDBM24724((adamantan-1-ylmethyl)({3-[(7-chloroquinolin-4-yl)...)
Affinity DataIC50:  3.20E+4nMpH: 7.3 T: 2°C. Assay description: Botox A catalyzed the hydrolysis of substrate peptide between residues 11 (glutamine) and 12 (arginine), corresponding to residues 197 and 198 of SNA...
In DepthDetails ArticlePubMed