BDBM247314 US9447090, 759
SMILES Cc1nc2c(OCc3c(F)cccc3F)cccn2c1C(=O)N[C@H]1[C@H](O)[C@H](O)c2ccccc12
InChI Key InChIKey=HQJKOTUCUNVFRF-MZYLBHOOSA-N
Data  1 EC50
  Tab Delimited (TSV)   2D SDfile   Computed 3D by Vconf -m prep SDfile
Find this compound or compounds like it in BindingDB:
Activity Spreadsheet -- Enzyme Inhibition Constant Data from BindingDB
Found 1 hit for monomerid = 247314
TargetGuanylate cyclase soluble subunit alpha-1/beta-1(Homo sapiens (Human))
Astellas Pharma
US Patent
LigandPNGBDBM247314(US9447090, 759)
Affinity DataEC50:  2.20E+3nMT: 2°C. Assay description: The activity of sGC was evaluated by measuring the amount of a cyclic guanosine monophosphate (cGMP) which is produced by human purified sGC. A test ...
Ligand InfoPC cidPC sid
In DepthDetails US Patent