BDBM247333 US9447091, 47
SMILES CC(C)(O)CCn1cc(nn1)-c1ccc2n(cnc2c1)-c1cc(NS(=O)(=O)C2CC2)cc(c1)-c1ccc(F)cc1F
InChI Key InChIKey=IQRIJICJXDRHPJ-UHFFFAOYSA-N
Data  1 IC50
  Tab Delimited (TSV)   2D SDfile   Computed 3D by Vconf -m prep SDfile
Find this compound or compounds like it in BindingDB:
Activity Spreadsheet -- Enzyme Inhibition Constant Data from BindingDB
Found 1 hit for monomerid = 247333
TargetFibroblast growth factor receptor 1(Homo sapiens (Human))
Orion
US Patent
LigandPNGBDBM247333(US9447091, 47)
Affinity DataIC50:  7nM. Assay description: Compounds were screened in the TR-FRET assay with FGFR1 kinase. 5 ng of FGFR1 [Upstate, USA] kinase was used for assay. The compound was incubated wi...
Ligand InfoPC cidPC sid
In DepthDetails US Patent