BDBM24735 (2S)-6-amino-N-[(1S)-5-amino-1-{[(2S)-5-carbamimidamido-1-oxopentan-2-yl]carbamoyl}pentyl]-2-[(benzylcarbamoyl)amino]hexanamide::Capped tripeptide aldehyde inhibitor, 23
SMILES [#7]-[#6]-[#6]-[#6]-[#6]-[#6@H](-[#7]-[#6](=O)-[#7]-[#6]-c1ccccc1)-[#6](=O)-[#7]-[#6@@H](-[#6]-[#6]-[#6]-[#6]-[#7])-[#6](=O)-[#7]-[#6@@H](-[#6]-[#6]-[#6]\[#7]=[#6](/[#7])-[#7])-[#6]=O
InChI Key InChIKey=SJEROJSJOCUVKE-FKBYEOEOSA-N
Data  1 KI  1 IC50
  Tab Delimited (TSV)   2D SDfile   Computed 3D by Vconf -m prep SDfile
Find this compound or compounds like it in BindingDB:
Activity Spreadsheet -- Enzyme Inhibition Constant Data from BindingDB
Found 1 hit for monomerid = 24735
TargetGenome polyprotein [1424-1463]/[1502-1685](West Nile virus (WNV))
University Of Queensland
LigandPNGBDBM24735((2S)-6-amino-N-[(1S)-5-amino-1-{[(2S)-5-carbamimid...)
Affinity DataKi:  26nM ΔG°:  -10.8kcal/mole IC50:  146nMpH: 9.5 T: 2°C. Assay description: Inhibition of WNV protease activity was measured using recombinant WNV protease, which first incubated with inhibitor in 96-well plates. Catalysis wa...
In DepthDetails ArticlePubMed