BDBM247458 US9453023, 17
SMILES C[C@H]1CCCN1[C@H]1CC[C@@H](CC1)c1ccc(N2CCC3(CCNCC3)C2=O)c(F)c1
InChI Key InChIKey=LZAFNRKWZXDHQV-ZJOUEHCJSA-N
Data  1 KI
  Tab Delimited (TSV)   2D SDfile   Computed 3D by Vconf -m prep SDfile
Find this compound or compounds like it in BindingDB:
Activity Spreadsheet -- Enzyme Inhibition Constant Data from BindingDB
Found 1 hit for monomerid = 247458
TargetHistamine receptor H3(Macaca mulatta (Rhesus macaque))
Sanofi
US Patent
LigandPNGBDBM247458(US9453023, 17)
Affinity DataKi:  84.3nM. Assay description: Rhesus H3 radioligand binding assay was performed using rhesus H3 receptor membranes (prepared as described above), [3H]-Methylhistamine (Perkin Elme...
Ligand InfoPC cidPC sid
In DepthDetails US Patent